{"text_format":"3","workbook":"xlsx","n_sheets":2,"sheets":["RAS","Lookup"],"not_rendered":{"defined_names":3},"read":"whole","date_system":"1900"}

{"sheet":"RAS","index":0,"n_rows":56,"n_cols":6,"rows_kept":56,"merged":[[4,0,4,2],[6,0,6,2],[10,0,10,2],[13,0,13,2],[15,0,15,2],[17,0,17,2],[20,0,20,2],[26,0,26,2],[34,0,34,2],[39,0,39,2],[40,1,40,2],[41,0,41,2],[44,0,44,2],[50,0,50,2]]}
["Care Home"]
["Name"]
[]
["RAS Tool Questions","RAS Tool Question Answer","Clinical Rationale","Minutes","DCC Review RAS Scoring","Difference to ECG"]
["Supporting the person in explaining their situation"]
["If the person has a sensory impairment, how does this affect their independence?\nIncluding hypersensitivity",null,null,{"$f":"_xlfn.XLOOKUP(_xlfn.CONCAT(A6,B6),Lookup!$F:$F,Lookup!$C:$C,0)","v":0},null,{"$f":"IFERROR(IF(_xlfn.XLOOKUP(_xlfn.CONCAT(A6,E6),Lookup!$F:$F,Lookup!$D:$D)-_xlfn.XLOOKUP(_xlfn.CONCAT(A6,B6),Lookup!$F:$F,Lookup!$D:$D)=0,\"Same\",IF(_xlfn.XLOOKUP(_xlfn.CONCAT(A6,E6),Lookup!$F:$F,Lookup!$D:$D)-_xlfn.XLOOKUP(_xlfn.CONCAT(A6,B6),Lookup!$F:$F,Lookup!$D:$D)>0,\"Higher\",\"Lower\")),\"\")","v":""}]
["Social relationships and community activities"]
["Attending appointments in the community - is the person independent?\nFor example, with their GP or at hospital, or to collect medication",null,null,{"$f":"_xlfn.XLOOKUP(_xlfn.CONCAT(A8,B8),Lookup!$F:$F,Lookup!$C:$C,0)","v":0},null,{"$f":"IFERROR(IF(_xlfn.XLOOKUP(_xlfn.CONCAT(A8,E8),Lookup!$F:$F,Lookup!$D:$D)-_xlfn.XLOOKUP(_xlfn.CONCAT(A8,B8),Lookup!$F:$F,Lookup!$D:$D)=0,\"Same\",IF(_xlfn.XLOOKUP(_xlfn.CONCAT(A8,E8),Lookup!$F:$F,Lookup!$D:$D)-_xlfn.XLOOKUP(_xlfn.CONCAT(A8,B8),Lookup!$F:$F,Lookup!$D:$D)>0,\"Higher\",\"Lower\")),\"\")","v":""}]
["Maintaining relationships and engaging in leisure, cultural or spiritual activities - level of independence:",null,null,{"$f":"_xlfn.XLOOKUP(_xlfn.CONCAT(A9,B9),Lookup!$F:$F,Lookup!$C:$C,0)","v":0},null,{"$f":"IFERROR(IF(_xlfn.XLOOKUP(_xlfn.CONCAT(A9,E9),Lookup!$F:$F,Lookup!$D:$D)-_xlfn.XLOOKUP(_xlfn.CONCAT(A9,B9),Lookup!$F:$F,Lookup!$D:$D)=0,\"Same\",IF(_xlfn.XLOOKUP(_xlfn.CONCAT(A9,E9),Lookup!$F:$F,Lookup!$D:$D)-_xlfn.XLOOKUP(_xlfn.CONCAT(A9,B9),Lookup!$F:$F,Lookup!$D:$D)>0,\"Higher\",\"Lower\")),\"\")","v":""}]
["Maintaining relationships and engaging in leisure, cultural or spiritual activities - what is the impact of social isolation on emotional wellbeing?",null,null,{"$f":"_xlfn.XLOOKUP(_xlfn.CONCAT(A10,B10),Lookup!$F:$F,Lookup!$C:$C,0)","v":0},null,{"$f":"IFERROR(IF(_xlfn.XLOOKUP(_xlfn.CONCAT(A10,E10),Lookup!$F:$F,Lookup!$D:$D)-_xlfn.XLOOKUP(_xlfn.CONCAT(A10,B10),Lookup!$F:$F,Lookup!$D:$D)=0,\"Same\",IF(_xlfn.XLOOKUP(_xlfn.CONCAT(A10,E10),Lookup!$F:$F,Lookup!$D:$D)-_xlfn.XLOOKUP(_xlfn.CONCAT(A10,B10),Lookup!$F:$F,Lookup!$D:$D)>0,\"Higher\",\"Lower\")),\"\")","v":""}]
["Work, training, education and volunteering"]
["Accessing and engaging in work, training, education or volunteering - level of independence:",null,null,{"$f":"_xlfn.XLOOKUP(_xlfn.CONCAT(A12,B12),Lookup!$F:$F,Lookup!$C:$C,0)","v":0},null,{"$f":"IFERROR(IF(_xlfn.XLOOKUP(_xlfn.CONCAT(A12,E12),Lookup!$F:$F,Lookup!$D:$D)-_xlfn.XLOOKUP(_xlfn.CONCAT(A12,B12),Lookup!$F:$F,Lookup!$D:$D)=0,\"Same\",IF(_xlfn.XLOOKUP(_xlfn.CONCAT(A12,E12),Lookup!$F:$F,Lookup!$D:$D)-_xlfn.XLOOKUP(_xlfn.CONCAT(A12,B12),Lookup!$F:$F,Lookup!$D:$D)>0,\"Higher\",\"Lower\")),\"\")","v":""}]
["Accessing and engaging in work, training, education or volunteering - how often support is needed?",null,null,{"$f":"_xlfn.XLOOKUP(_xlfn.CONCAT(A13,B13),Lookup!$F:$F,Lookup!$C:$C,0)","v":0},null,{"$f":"IFERROR(IF(_xlfn.XLOOKUP(_xlfn.CONCAT(A13,E13),Lookup!$F:$F,Lookup!$D:$D)-_xlfn.XLOOKUP(_xlfn.CONCAT(A13,B13),Lookup!$F:$F,Lookup!$D:$D)=0,\"Same\",IF(_xlfn.XLOOKUP(_xlfn.CONCAT(A13,E13),Lookup!$F:$F,Lookup!$D:$D)-_xlfn.XLOOKUP(_xlfn.CONCAT(A13,B13),Lookup!$F:$F,Lookup!$D:$D)>0,\"Higher\",\"Lower\")),\"\")","v":""}]
["Caring for others"]
["Carrying out caring responsibilities for a child - how often is support needed?",null,null,{"$f":"_xlfn.XLOOKUP(_xlfn.CONCAT(A15,B15),Lookup!$F:$F,Lookup!$C:$C,0)","v":0},null,{"$f":"IFERROR(IF(_xlfn.XLOOKUP(_xlfn.CONCAT(A15,E15),Lookup!$F:$F,Lookup!$D:$D)-_xlfn.XLOOKUP(_xlfn.CONCAT(A15,B15),Lookup!$F:$F,Lookup!$D:$D)=0,\"Same\",IF(_xlfn.XLOOKUP(_xlfn.CONCAT(A15,E15),Lookup!$F:$F,Lookup!$D:$D)-_xlfn.XLOOKUP(_xlfn.CONCAT(A15,B15),Lookup!$F:$F,Lookup!$D:$D)>0,\"Higher\",\"Lower\")),\"\")","v":""}]
["Home and living situation"]
["Maintaining and cleaning the home - level of independence:",null,null,{"$f":"_xlfn.XLOOKUP(_xlfn.CONCAT(A17,B17),Lookup!$F:$F,Lookup!$C:$C,0)","v":0},null,{"$f":"IFERROR(IF(_xlfn.XLOOKUP(_xlfn.CONCAT(A17,E17),Lookup!$F:$F,Lookup!$D:$D)-_xlfn.XLOOKUP(_xlfn.CONCAT(A17,B17),Lookup!$F:$F,Lookup!$D:$D)=0,\"Same\",IF(_xlfn.XLOOKUP(_xlfn.CONCAT(A17,E17),Lookup!$F:$F,Lookup!$D:$D)-_xlfn.XLOOKUP(_xlfn.CONCAT(A17,B17),Lookup!$F:$F,Lookup!$D:$D)>0,\"Higher\",\"Lower\")),\"\")","v":""}]
["Managing paperwork and finances"]
["Managing day to day paperwork - is the person independent?",null,null,{"$f":"_xlfn.XLOOKUP(_xlfn.CONCAT(A19,B19),Lookup!$F:$F,Lookup!$C:$C,0)","v":0},null,{"$f":"IFERROR(IF(_xlfn.XLOOKUP(_xlfn.CONCAT(A19,E19),Lookup!$F:$F,Lookup!$D:$D)-_xlfn.XLOOKUP(_xlfn.CONCAT(A19,B19),Lookup!$F:$F,Lookup!$D:$D)=0,\"Same\",IF(_xlfn.XLOOKUP(_xlfn.CONCAT(A19,E19),Lookup!$F:$F,Lookup!$D:$D)-_xlfn.XLOOKUP(_xlfn.CONCAT(A19,B19),Lookup!$F:$F,Lookup!$D:$D)>0,\"Higher\",\"Lower\")),\"\")","v":""}]
["Managing finance - is the person independent?",null,null,{"$f":"_xlfn.XLOOKUP(_xlfn.CONCAT(A20,B20),Lookup!$F:$F,Lookup!$C:$C,0)","v":0},null,{"$f":"IFERROR(IF(_xlfn.XLOOKUP(_xlfn.CONCAT(A20,E20),Lookup!$F:$F,Lookup!$D:$D)-_xlfn.XLOOKUP(_xlfn.CONCAT(A20,B20),Lookup!$F:$F,Lookup!$D:$D)=0,\"Same\",IF(_xlfn.XLOOKUP(_xlfn.CONCAT(A20,E20),Lookup!$F:$F,Lookup!$D:$D)-_xlfn.XLOOKUP(_xlfn.CONCAT(A20,B20),Lookup!$F:$F,Lookup!$D:$D)>0,\"Higher\",\"Lower\")),\"\")","v":""}]
["Eating healthily and safely"]
["Shopping for food and essentials - is the person independent?",null,null,{"$f":"_xlfn.XLOOKUP(_xlfn.CONCAT(A22,B22),Lookup!$F:$F,Lookup!$C:$C,0)","v":0},null,{"$f":"IFERROR(IF(_xlfn.XLOOKUP(_xlfn.CONCAT(A22,E22),Lookup!$F:$F,Lookup!$D:$D)-_xlfn.XLOOKUP(_xlfn.CONCAT(A22,B22),Lookup!$F:$F,Lookup!$D:$D)=0,\"Same\",IF(_xlfn.XLOOKUP(_xlfn.CONCAT(A22,E22),Lookup!$F:$F,Lookup!$D:$D)-_xlfn.XLOOKUP(_xlfn.CONCAT(A22,B22),Lookup!$F:$F,Lookup!$D:$D)>0,\"Higher\",\"Lower\")),\"\")","v":""}]
["Preparing meals, snacks and drinks – is the person independent?",null,null,{"$f":"_xlfn.XLOOKUP(_xlfn.CONCAT(A23,B23),Lookup!$F:$F,Lookup!$C:$C,0)","v":0},null,{"$f":"IFERROR(IF(_xlfn.XLOOKUP(_xlfn.CONCAT(A23,E23),Lookup!$F:$F,Lookup!$D:$D)-_xlfn.XLOOKUP(_xlfn.CONCAT(A23,B23),Lookup!$F:$F,Lookup!$D:$D)=0,\"Same\",IF(_xlfn.XLOOKUP(_xlfn.CONCAT(A23,E23),Lookup!$F:$F,Lookup!$D:$D)-_xlfn.XLOOKUP(_xlfn.CONCAT(A23,B23),Lookup!$F:$F,Lookup!$D:$D)>0,\"Higher\",\"Lower\")),\"\")","v":""}]
["Preparing meals, snack and drinks – how often is support needed?",null,null,{"$f":"_xlfn.XLOOKUP(_xlfn.CONCAT(A24,B24),Lookup!$F:$F,Lookup!$C:$C,0)","v":0},null,{"$f":"IFERROR(IF(_xlfn.XLOOKUP(_xlfn.CONCAT(A24,E24),Lookup!$F:$F,Lookup!$D:$D)-_xlfn.XLOOKUP(_xlfn.CONCAT(A24,B24),Lookup!$F:$F,Lookup!$D:$D)=0,\"Same\",IF(_xlfn.XLOOKUP(_xlfn.CONCAT(A24,E24),Lookup!$F:$F,Lookup!$D:$D)-_xlfn.XLOOKUP(_xlfn.CONCAT(A24,B24),Lookup!$F:$F,Lookup!$D:$D)>0,\"Higher\",\"Lower\")),\"\")","v":""}]
["Eating and drinking – is the person independent?",null,null,{"$f":"_xlfn.XLOOKUP(_xlfn.CONCAT(A25,B25),Lookup!$F:$F,Lookup!$C:$C,0)","v":0},null,{"$f":"IFERROR(IF(_xlfn.XLOOKUP(_xlfn.CONCAT(A25,E25),Lookup!$F:$F,Lookup!$D:$D)-_xlfn.XLOOKUP(_xlfn.CONCAT(A25,B25),Lookup!$F:$F,Lookup!$D:$D)=0,\"Same\",IF(_xlfn.XLOOKUP(_xlfn.CONCAT(A25,E25),Lookup!$F:$F,Lookup!$D:$D)-_xlfn.XLOOKUP(_xlfn.CONCAT(A25,B25),Lookup!$F:$F,Lookup!$D:$D)>0,\"Higher\",\"Lower\")),\"\")","v":""}]
["If someone needs to support the person being fed, how long does the support for this usually take?",null,null,{"$f":"_xlfn.XLOOKUP(_xlfn.CONCAT(A26,B26),Lookup!$F:$F,Lookup!$C:$C,0)","v":0},null,{"$f":"IFERROR(IF(_xlfn.XLOOKUP(_xlfn.CONCAT(A26,E26),Lookup!$F:$F,Lookup!$D:$D)-_xlfn.XLOOKUP(_xlfn.CONCAT(A26,B26),Lookup!$F:$F,Lookup!$D:$D)=0,\"Same\",IF(_xlfn.XLOOKUP(_xlfn.CONCAT(A26,E26),Lookup!$F:$F,Lookup!$D:$D)-_xlfn.XLOOKUP(_xlfn.CONCAT(A26,B26),Lookup!$F:$F,Lookup!$D:$D)>0,\"Higher\",\"Lower\")),\"\")","v":""}]
["Personal Care"]
["Getting dressed for the day and choosing appropriate clothes to wear – is the person independent?",null,null,{"$f":"_xlfn.XLOOKUP(_xlfn.CONCAT(A28,B28),Lookup!$F:$F,Lookup!$C:$C,0)","v":0},null,{"$f":"IFERROR(IF(_xlfn.XLOOKUP(_xlfn.CONCAT(A28,E28),Lookup!$F:$F,Lookup!$D:$D)-_xlfn.XLOOKUP(_xlfn.CONCAT(A28,B28),Lookup!$F:$F,Lookup!$D:$D)=0,\"Same\",IF(_xlfn.XLOOKUP(_xlfn.CONCAT(A28,E28),Lookup!$F:$F,Lookup!$D:$D)-_xlfn.XLOOKUP(_xlfn.CONCAT(A28,B28),Lookup!$F:$F,Lookup!$D:$D)>0,\"Higher\",\"Lower\")),\"\")","v":""}]
["Getting undressed at the end of the day – is the person independent?",null,null,{"$f":"_xlfn.XLOOKUP(_xlfn.CONCAT(A29,B29),Lookup!$F:$F,Lookup!$C:$C,0)","v":0},null,{"$f":"IFERROR(IF(_xlfn.XLOOKUP(_xlfn.CONCAT(A29,E29),Lookup!$F:$F,Lookup!$D:$D)-_xlfn.XLOOKUP(_xlfn.CONCAT(A29,B29),Lookup!$F:$F,Lookup!$D:$D)=0,\"Same\",IF(_xlfn.XLOOKUP(_xlfn.CONCAT(A29,E29),Lookup!$F:$F,Lookup!$D:$D)-_xlfn.XLOOKUP(_xlfn.CONCAT(A29,B29),Lookup!$F:$F,Lookup!$D:$D)>0,\"Higher\",\"Lower\")),\"\")","v":""}]
["Managing person appearance – is the person independent?\nThis includes washing hands and face, brushing hair and nails, and shaving",null,null,{"$f":"_xlfn.XLOOKUP(_xlfn.CONCAT(A30,B30),Lookup!$F:$F,Lookup!$C:$C,0)","v":0},null,{"$f":"IFERROR(IF(_xlfn.XLOOKUP(_xlfn.CONCAT(A30,E30),Lookup!$F:$F,Lookup!$D:$D)-_xlfn.XLOOKUP(_xlfn.CONCAT(A30,B30),Lookup!$F:$F,Lookup!$D:$D)=0,\"Same\",IF(_xlfn.XLOOKUP(_xlfn.CONCAT(A30,E30),Lookup!$F:$F,Lookup!$D:$D)-_xlfn.XLOOKUP(_xlfn.CONCAT(A30,B30),Lookup!$F:$F,Lookup!$D:$D)>0,\"Higher\",\"Lower\")),\"\")","v":""}]
{"$rows_left_out":27}
{"sheet":"Lookup","index":1,"n_rows":198,"n_cols":6,"rows_kept":198,"hidden":true,"merged":[[2,0,7,0],[9,0,10,0],[11,0,16,0],[17,0,21,0],[23,0,29,0],[30,0,35,0],[37,0,42,0],[44,0,48,0],[50,0,51,0],[52,0,53,0],[55,0,59,0],[60,0,64,0],[65,0,71,0],[72,0,76,0],[77,0,79,0],[81,0,85,0],[86,0,90,0],[91,0,95,0],[96,0,100,0],[101,0,109,0],[110,0,114,0],[115,0,121,0],[123,0,127,0],[128,0,129,0],[130,0,132,0],[133,0,137,0],[139,0,143,0],[144,0,150,0],[152,0,156,0],[157,0,161,0],[162,0,166,0],[167,0,171,0],[172,0,176,0],[178,0,184,0],[185,0,191,0],[192,0,197,0]]}
["Section","Answers","Minutes","Ranking","Question","ID"]
["Supporting the person in explaining their situation",{"$nulls":3},{"$f":"IF(A2=\"\",E1,A2)","v":"Supporting the person in explaining their situation"},{"$f":"_xlfn.CONCAT(E2,B2)","v":"Supporting the person in explaining their situation"}]
["If the person has a sensory impairment, how does this affect their independence?\nIncluding hypersensitivity","Does not apply",0,{"$f":"COUNTIF($E$3:$E3,$E3)","v":1},{"$f":"IF(A3=\"\",E2,A3)","v":"If the person has a sensory impairment, how does this affect their independence?\nIncluding hypersensitivity"},"If the person has a sensory impairment, how does this affect their independence?\nIncluding hypersensitivityDoes not apply"]
[null,"Largely unaffected by impairment",0,{"$f":"COUNTIF($E$3:$E4,$E4)","v":2},"If the person has a sensory impairment, how does this affect their independence?\nIncluding hypersensitivity","If the person has a sensory impairment, how does this affect their independence?\nIncluding hypersensitivityLargely unaffected by impairment"]
[null,"Impairment causes mild restrictions",0,{"$f":"COUNTIF($E$3:$E5,$E5)","v":3},"If the person has a sensory impairment, how does this affect their independence?\nIncluding hypersensitivity","If the person has a sensory impairment, how does this affect their independence?\nIncluding hypersensitivityImpairment causes mild restrictions"]
[null,"Impairment causes significant restrictions",0,{"$f":"COUNTIF($E$3:$E6,$E6)","v":4},"If the person has a sensory impairment, how does this affect their independence?\nIncluding hypersensitivity","If the person has a sensory impairment, how does this affect their independence?\nIncluding hypersensitivityImpairment causes significant restrictions"]
[null,"Impairment causes major restrictions",0,{"$f":"COUNTIF($E$3:$E7,$E7)","v":5},"If the person has a sensory impairment, how does this affect their independence?\nIncluding hypersensitivity","If the person has a sensory impairment, how does this affect their independence?\nIncluding hypersensitivityImpairment causes major restrictions"]
[null,"Impairment severly limits life",0,{"$f":"COUNTIF($E$3:$E8,$E8)","v":6},"If the person has a sensory impairment, how does this affect their independence?\nIncluding hypersensitivity","If the person has a sensory impairment, how does this affect their independence?\nIncluding hypersensitivityImpairment severly limits life"]
["Social relationships and community activities",null,null,{"$f":"COUNTIF($E$3:$E9,$E9)","v":1},"Social relationships and community activities","Social relationships and community activities"]
["Attending appointments in the community - is the person independent?\nFor example, with their GP or at hospital, or to collect medication","Yes",0,{"$f":"COUNTIF($E$3:$E10,$E10)","v":1},"Attending appointments in the community - is the person independent?\nFor example, with their GP or at hospital, or to collect medication","Attending appointments in the community - is the person independent?\nFor example, with their GP or at hospital, or to collect medicationYes"]
[null,"No",0,{"$f":"COUNTIF($E$3:$E11,$E11)","v":2},"Attending appointments in the community - is the person independent?\nFor example, with their GP or at hospital, or to collect medication","Attending appointments in the community - is the person independent?\nFor example, with their GP or at hospital, or to collect medicationNo"]
["Maintaining relationships and engaging in leisure, cultural or spiritual activities - level of independence:","Manages independently",0,{"$f":"COUNTIF($E$3:$E12,$E12)","v":1},"Maintaining relationships and engaging in leisure, cultural or spiritual activities - level of independence:","Maintaining relationships and engaging in leisure, cultural or spiritual activities - level of independence:Manages independently"]
[null,"Manages with support to get there independently",0,{"$f":"COUNTIF($E$3:$E13,$E13)","v":2},"Maintaining relationships and engaging in leisure, cultural or spiritual activities - level of independence:","Maintaining relationships and engaging in leisure, cultural or spiritual activities - level of independence:Manages with support to get there independently"]
[null,"Manages if supported as part of a group",0,{"$f":"COUNTIF($E$3:$E14,$E14)","v":3},"Maintaining relationships and engaging in leisure, cultural or spiritual activities - level of independence:","Maintaining relationships and engaging in leisure, cultural or spiritual activities - level of independence:Manages if supported as part of a group"]
[null,"Manages with one-to-one support",0,{"$f":"COUNTIF($E$3:$E15,$E15)","v":4},"Maintaining relationships and engaging in leisure, cultural or spiritual activities - level of independence:","Maintaining relationships and engaging in leisure, cultural or spiritual activities - level of independence:Manages with one-to-one support"]
[null,"Manages with two-to-one support (or more)",0,{"$f":"COUNTIF($E$3:$E16,$E16)","v":5},"Maintaining relationships and engaging in leisure, cultural or spiritual activities - level of independence:","Maintaining relationships and engaging in leisure, cultural or spiritual activities - level of independence:Manages with two-to-one support (or more)"]
[null,"Person needs' means it is not possible",0,{"$f":"COUNTIF($E$3:$E17,$E17)","v":6},"Maintaining relationships and engaging in leisure, cultural or spiritual activities - level of independence:","Maintaining relationships and engaging in leisure, cultural or spiritual activities - level of independence:Person needs' means it is not possible"]
["Maintaining relationships and engaging in leisure, cultural or spiritual activities - what is the impact of social isolation on emotional wellbeing?","No impact or risk",0,{"$f":"COUNTIF($E$3:$E18,$E18)","v":1},"Maintaining relationships and engaging in leisure, cultural or spiritual activities - what is the impact of social isolation on emotional wellbeing?","Maintaining relationships and engaging in leisure, cultural or spiritual activities - what is the impact of social isolation on emotional wellbeing?No impact or risk"]
[null,"Low impact or risk",0,{"$f":"COUNTIF($E$3:$E19,$E19)","v":2},"Maintaining relationships and engaging in leisure, cultural or spiritual activities - what is the impact of social isolation on emotional wellbeing?","Maintaining relationships and engaging in leisure, cultural or spiritual activities - what is the impact of social isolation on emotional wellbeing?Low impact or risk"]
[null,"Moderate impact or risk",0,{"$f":"COUNTIF($E$3:$E20,$E20)","v":3},"Maintaining relationships and engaging in leisure, cultural or spiritual activities - what is the impact of social isolation on emotional wellbeing?","Maintaining relationships and engaging in leisure, cultural or spiritual activities - what is the impact of social isolation on emotional wellbeing?Moderate impact or risk"]
[null,"High impact or risk",0,{"$f":"COUNTIF($E$3:$E21,$E21)","v":4},"Maintaining relationships and engaging in leisure, cultural or spiritual activities - what is the impact of social isolation on emotional wellbeing?","Maintaining relationships and engaging in leisure, cultural or spiritual activities - what is the impact of social isolation on emotional wellbeing?High impact or risk"]
[null,"Very high impact or risk",0,{"$f":"COUNTIF($E$3:$E22,$E22)","v":5},"Maintaining relationships and engaging in leisure, cultural or spiritual activities - what is the impact of social isolation on emotional wellbeing?","Maintaining relationships and engaging in leisure, cultural or spiritual activities - what is the impact of social isolation on emotional wellbeing?Very high impact or risk"]
["Work, training, education and volunteering",null,null,{"$f":"COUNTIF($E$3:$E23,$E23)","v":1},"Work, training, education and volunteering","Work, training, education and volunteering"]
["Accessing and engaging in work, training, education or volunteering - level of independence:","Manages independently",0,{"$f":"COUNTIF($E$3:$E24,$E24)","v":1},"Accessing and engaging in work, training, education or volunteering - level of independence:","Accessing and engaging in work, training, education or volunteering - level of independence:Manages independently"]
[null,"Manages with support to travel only",0,{"$f":"COUNTIF($E$3:$E25,$E25)","v":2},"Accessing and engaging in work, training, education or volunteering - level of independence:","Accessing and engaging in work, training, education or volunteering - level of independence:Manages with support to travel only"]
[null,"Manages if supported as part of a group",0,{"$f":"COUNTIF($E$3:$E26,$E26)","v":3},"Accessing and engaging in work, training, education or volunteering - level of independence:","Accessing and engaging in work, training, education or volunteering - level of independence:Manages if supported as part of a group"]
[null,"Manages with one-to-one support",0,{"$f":"COUNTIF($E$3:$E27,$E27)","v":4},"Accessing and engaging in work, training, education or volunteering - level of independence:","Accessing and engaging in work, training, education or volunteering - level of independence:Manages with one-to-one support"]
[null,"Manages with two-to-one support (or more)",0,{"$f":"COUNTIF($E$3:$E28,$E28)","v":5},"Accessing and engaging in work, training, education or volunteering - level of independence:","Accessing and engaging in work, training, education or volunteering - level of independence:Manages with two-to-one support (or more)"]
[null,"Prefers not to participate",0,{"$f":"COUNTIF($E$3:$E29,$E29)","v":6},"Accessing and engaging in work, training, education or volunteering - level of independence:","Accessing and engaging in work, training, education or volunteering - level of independence:Prefers not to participate"]
[null,"Person needs' means it is not possible",0,{"$f":"COUNTIF($E$3:$E30,$E30)","v":7},"Accessing and engaging in work, training, education or volunteering - level of independence:","Accessing and engaging in work, training, education or volunteering - level of independence:Person needs' means it is not possible"]
{"$rows_left_out":168}